{"text_format":"1","workbook":"xlsx","n_sheets":2,"sheets":["JumpStartInputTool","Master20200430"],"not_rendered":{"charts":0,"images":0,"macros":1,"external_links":0,"defined_names":6,"comments":1,"pivot_tables":0},"unopened":[],"bounds":{"document_bytes":16777216,"sheet_cells":100000,"rows_first":2000,"rows_last":500,"rows_between":2000,"halvings":0,"cell_chars":16384,"cell_head_chars":4096},"cells_cut":0,"cells_raw":0,"read":"whole","date_system":"1900"}

{"sheet":"JumpStartInputTool","index":0,"n_rows":19,"n_cols":3,"rows_kept":19,"cut":false,"hidden":false,"merged":[[18,1,18,4],[17,1,17,4],[2,3,3,3],[9,2,9,3],[11,2,11,3],[13,2,13,3]]}
[]
[null,"Department of Behavioral Health and Developmental Services"]
[null,"Division of Developmental Services"]
[null,"Jump-Start Calculator"]
[]
[null,"Select City or County","Chesterfield County"]
[]
[null,"Select Service","In-home Supports"]
[]
[null,"Waiver Enrollees (All waivers)",{"$f":"IF(C6=\"\",\"Please Select a City/County\",CONCATENATE(VLOOKUP(C6,Master20200430!D:H,5,0),\" individual(s) were enrolled on a waiver in \",C6, \" as of \", \"Apr. 30, 2020.\"))","v":"1121 individual(s) were enrolled on a waiver in Chesterfield County as of Apr. 30, 2020."}]
[]
[null,"Building Independence Waiver",{"$f":"IF(C6=\"\",\"Please Select a City/County\",CONCATENATE(VLOOKUP(C6,Master20200430!D:E,2,0),\" individual(s) were enrolled on a BI waiver in \",C6, \" as of Apr. 30, 2020.\"))","v":"25 individual(s) were enrolled on a BI waiver in Chesterfield County as of Apr. 30, 2020."}]
[]
[null,"Total Providers of Selected Service in Selected City/County",{"$f":"IF(OR(C6=\"\",C8=\"\"),\"Please Select Both a City/County and a Service\",INDEX(Master20200430!Q2:AE134,MATCH(C6,Master20200430!CityCounty,0),MATCH(C8,Master20200430!Q1:AE1,0)))","v":3}]
[]
[null,"Recommendations for JumpStart Application:"]
[null,{"$f":"IF((\"eligible\"=IFERROR(HLOOKUP(C8,Master20200430!AB1:AE1,1,FALSE),\"eligible\")),\"\",\"This service is not eligible for Jump-Start Funding.\")","v":""}]
[null,"Providers are insufficient in this area. Applications will be considered."]
[null,"There are sufficient providers in this area. You may: (1) Proceed with submission knowing that an increased amount of justification will be necessary, or (2) select a different City/County and/or Service."]

{"sheet":"Master20200430","index":1,"n_rows":176,"n_cols":32,"rows_kept":176,"cut":false,"hidden":true,"merged":[]}
["DS Region","SubRegion","CSB"," City/County","BI waiver","FIS waiver","CL waiver","All waivers","SIS\nL1","SIS\nL2","SIS\nL3","SIS\nL4","SIS\nL5","SIS\nL6","SIS\nL7","SIS\nDefault","Benefits Planning","Community Coaching","Community Engagement","Community Guide","Electronic Home-Based Services","Employment and Community Transportation","Independent Living Supports","In-home Supports","Peer Mentoring","Shared Living","Supported Living","Crisis Support Services","Private Duty Nursing","Skilled Nursing","Sponsored Residential","Total Unique"]
["Eastern","5-B","EAST","Accomack County",0,6,62,68,5,24,1,31,0,6,0,1,0,0,1,0,0,0,0,1,0,0,1,0,0,0,0,1]
["Western","1-A","RTEN","Albemarle County",7,40,92,139,11,50,2,45,3,7,1,20,0,3,3,0,0,0,1,3,0,0,0,0,1,1,3,5]
["Northern","2-A","ALEX","Alexandria City",4,23,75,102,11,38,5,37,1,3,2,5,0,0,1,1,0,0,0,1,0,0,2,0,2,0,0,5]
["Western","1-C","ALLE","Alleghany County",1,11,38,50,7,19,1,13,0,5,2,3,0,0,1,0,0,0,0,2,0,0,0,0,0,0,0,2]
["Central","4-B","CROS","Amelia County",0,1,11,12,0,4,0,8,0,0,0,0,0,0,0,0,0,0,0,0,0,0,0,0,0,0,0,0]
["Western","1-D","HORI","Amherst County",0,16,158,174,3,32,6,87,4,18,18,6,0,1,1,0,0,0,0,0,0,0,0,0,0,0,3,3]
["Western","1-D","HORI","Appomattox County",0,10,27,37,1,11,2,9,3,5,4,2,0,0,0,0,0,0,0,1,0,0,0,0,0,0,1,1]
["Northern","2-A","ARLI","Arlington County",5,48,113,166,10,47,7,53,4,10,10,25,0,0,0,0,0,0,0,1,0,0,0,0,0,0,0,1]
["Western","1-B","VLY","Augusta County",1,23,134,158,5,46,4,49,3,24,14,13,0,1,1,0,0,0,0,1,0,0,0,0,0,0,2,2]
["Western","1-C","ROC","Bath County",0,1,7,8,2,0,2,3,0,1,0,0,0,0,0,0,0,0,0,0,0,0,0,0,0,0,0,0]
["Western","1-D","HORI","Bedford County",1,31,160,192,4,40,4,79,8,34,15,8,0,1,5,0,0,0,0,2,0,0,0,0,0,1,4,6]
["Southwestern","3-C","MTRG","Bland County",0,2,9,11,0,2,0,7,0,2,0,0,0,0,0,0,0,0,0,0,0,0,0,0,0,0,0,0]
["Southwestern","3-A","BLUE","Botetourt County",1,16,29,46,0,13,1,17,1,12,1,1,0,1,2,0,0,0,0,0,0,0,0,0,0,1,0,2]
["Southwestern","3-D","HIGH","Bristol City",1,3,45,49,2,15,1,21,2,6,0,2,0,0,0,0,0,0,0,1,0,0,0,0,0,0,0,1]
["Central","4-D","SS","Brunswick County",0,0,33,33,1,18,1,10,0,3,0,0,0,0,1,0,0,0,0,0,0,0,0,0,0,0,0,1]
["Southwestern","3-D","CMT","Buchanan County",0,5,28,33,0,12,0,14,0,4,0,3,0,0,1,0,0,0,0,1,0,0,0,0,0,0,0,1]
["Central","4-B","CROS","Buckingham County",1,1,15,17,0,6,1,6,1,2,0,1,0,0,0,0,0,0,0,0,0,0,0,0,0,0,0,0]
["Western","1-C","ROC","Buena Vista City",0,0,6,6,0,2,0,3,0,0,1,0,0,0,0,0,0,0,0,0,0,0,0,0,0,0,0,0]
["Western","1-D","HORI","Campbell County",2,31,145,178,6,43,8,65,9,27,14,6,0,0,0,0,0,0,0,0,0,0,0,0,0,0,0,0]
["Northern","2-C","RapA","Caroline County",0,7,39,46,5,14,2,16,2,3,4,0,0,0,0,0,0,0,0,0,0,0,0,0,0,0,0,0]
["Southwestern","3-B","MTRG","Carroll County",1,11,184,196,0,21,9,76,28,24,33,5,0,0,0,0,0,0,0,0,0,0,0,0,0,0,1,1]
["Central","4-A","HENR","Charles City County",0,2,3,5,0,3,0,1,0,0,0,1,0,0,0,0,0,0,0,0,0,0,0,0,0,0,0,0]
["Central","4-C","CROS","Charlotte County",0,6,26,32,3,13,4,7,0,1,2,2,0,0,2,0,0,0,0,0,0,0,0,0,0,0,0,2]
["Western","1-A","RTEN","Charlottesville City",3,16,69,88,11,36,0,23,1,11,0,6,0,0,0,0,0,0,0,0,0,0,0,0,0,0,0,0]
["Eastern","5-D","CHSP","Chesapeake City",10,93,298,401,17,104,14,175,17,35,20,19,0,4,7,0,0,0,1,6,0,0,0,0,5,3,7,20]
["Central","4-A","CHST","Chesterfield County",25,125,971,1121,77,382,51,377,30,78,83,43,0,3,10,0,0,0,1,3,0,0,3,0,4,2,5,21]
["Northern","2-D","NW","Clarke County",0,5,15,20,1,10,1,4,0,0,1,3,0,0,0,0,0,0,0,0,0,0,0,0,0,0,0,0]
["Central","4-A","D19","Colonial Heights City",1,4,20,25,4,7,0,6,1,2,0,5,0,0,3,0,0,0,0,1,0,0,0,0,0,0,1,4]
["Western","1-C","ALLE","Covington City",0,1,12,13,1,7,1,0,1,0,0,3,0,0,1,0,0,0,0,1,0,0,0,0,0,1,0,1]
["Southwestern","3-A","BLUE","Craig County",1,4,3,8,1,2,0,1,1,1,0,2,0,0,0,0,0,0,0,1,0,0,0,0,0,0,0,1]
["Northern","2-B","RapR","Culpeper County",2,12,87,101,17,49,2,19,1,4,2,7,0,1,3,0,0,0,0,0,0,0,0,0,0,1,0,3]
["Central","4-B","CROS","Cumberland County",1,1,26,28,1,8,0,15,2,1,0,1,0,0,1,0,0,0,0,0,0,0,0,0,0,0,0,1]
["Southwestern","3-B","DANV","Danville City",16,25,153,194,19,46,6,80,2,16,13,12,0,1,3,1,0,0,2,6,0,0,1,0,1,1,2,8]
["Southwestern","3-D","DCBH","Dickenson County",0,4,29,33,2,7,1,15,4,2,0,2,0,0,1,0,0,0,0,0,0,0,0,0,0,0,0,1]
["Central","4-D","D19","Dinwiddie County",0,5,63,68,1,17,4,32,2,4,6,2,0,0,0,0,0,0,0,0,0,0,0,0,0,0,1,1]
["Central","4-C","D19","Emporia City",0,4,3,7,0,2,0,3,0,1,0,1,0,0,0,0,0,0,0,0,0,0,0,0,1,0,0,1]
["Eastern","5-A","MPNN","Essex County",0,4,19,23,5,6,1,9,1,0,1,0,0,0,0,0,0,0,0,0,0,0,0,0,0,0,0,0]
["Northern","2-A","FFFC","Fairfax City",0,1,4,5,0,2,0,1,0,0,1,1,0,0,0,0,0,0,0,0,0,0,0,0,0,0,0,0]
["Northern","2-A","FFFC","Fairfax County",22,397,882,1301,79,344,56,449,34,102,97,140,0,7,7,0,0,0,1,16,0,0,3,1,22,4,2,43]
["Northern","2-A","FFFC","Falls Church City",0,0,2,2,0,0,0,0,0,0,2,0,0,0,0,0,0,0,0,0,0,0,0,0,2,0,0,2]
["Northern","2-B","RapR","Fauquier County",0,28,59,87,9,30,1,26,2,8,2,9,0,0,0,0,1,0,0,0,0,0,0,0,1,1,0,3]
["Southwestern","3-C","NRV","Floyd County",0,9,43,52,1,9,0,20,1,10,11,0,0,2,1,0,0,0,0,2,0,0,0,0,1,1,2,3]
["Western","1-A","RTEN","Fluvanna County",1,6,15,22,1,7,0,3,0,4,1,6,0,0,0,0,0,0,0,0,0,0,0,0,0,0,0,0]
["Eastern","5-D","WT","Franklin City",0,3,24,27,1,5,0,16,2,2,0,1,0,1,2,0,0,0,0,1,0,0,0,0,1,1,1,3]
["Southwestern","3-A","PDMT","Franklin County",5,15,89,109,3,32,9,36,4,20,5,0,0,0,1,0,0,0,0,0,0,0,0,0,0,0,0,1]
["Northern","2-D","NW","Frederick County",3,38,110,151,12,56,8,45,2,14,8,6,0,1,2,0,0,0,0,1,0,0,0,0,0,1,1,2]
["Northern","2-C","RapA","Fredericksburg City",1,9,50,60,10,17,1,17,3,4,2,6,0,1,1,0,0,0,0,1,0,0,1,0,0,0,2,2]
["Southwestern","3-B","MTRG","Galax City",0,1,33,34,1,6,0,13,3,2,8,1,0,0,3,0,0,0,0,1,0,0,0,0,0,1,3,5]
["Southwestern","3-A","NRV","Giles County",1,4,32,37,1,7,3,14,1,8,3,0,0,1,0,0,0,0,0,0,0,0,0,1,0,0,0,1]
["Eastern","5-A","MPNN","Gloucester County",0,13,77,90,5,26,0,25,9,16,2,7,0,0,1,0,0,0,0,1,0,0,0,0,2,1,0,3]
["Central","4-B","GOOC","Goochland County",1,6,20,27,0,11,1,7,1,4,2,1,0,0,1,0,0,0,0,1,0,0,0,0,0,0,1,2]
["Southwestern","3-B","MTRG","Grayson County",1,2,35,38,0,8,1,23,0,3,1,2,0,0,0,0,0,0,0,0,0,0,0,0,0,0,0,0]
["Western","1-A","RTEN","Greene County",0,8,15,23,3,6,1,7,1,3,0,2,0,0,0,0,0,0,0,0,0,0,0,0,0,0,0,0]
["Central","4-D","D19","Greensville County",0,1,8,9,0,2,0,5,1,1,0,0,0,0,0,0,0,0,0,0,0,0,0,0,0,0,0,0]
["Central","4-C","SS","Halifax County",1,12,74,87,9,35,6,24,3,3,2,5,0,1,1,0,0,0,0,0,0,0,0,0,0,0,0,1]
["Eastern","5-C","HAMP","Hampton City",10,49,239,298,10,72,7,137,16,29,21,6,0,4,7,0,0,0,0,3,0,0,1,0,2,1,6,13]
["Central","4-A","HANO","Hanover County",15,59,161,235,20,66,7,78,8,26,15,15,0,0,4,0,0,0,0,1,0,0,1,0,1,0,1,7]
["Western","1-B","HARR","Harrisonburg City",3,17,60,80,21,23,3,21,0,6,1,5,0,0,0,0,0,0,0,0,0,0,1,0,0,0,0,1]
["Central","4-A","HENR","Henrico County",22,137,500,659,49,247,24,227,8,23,45,36,3,2,9,0,0,0,2,5,0,1,2,0,2,1,4,17]
["Southwestern","3-B","PDMT","Henry County",3,16,89,108,7,35,5,34,2,9,9,7,0,0,0,0,0,0,0,0,0,0,0,0,0,0,0,0]
["Western","1-B","VLY","Highland County",0,0,8,8,0,1,0,5,0,1,1,0,0,0,0,0,0,0,0,0,0,0,0,0,0,0,0,0]
["Central","4-D","D19","Hopewell City",0,7,29,36,1,8,3,13,2,0,5,4,0,0,1,0,0,0,0,0,0,0,0,0,0,0,1,2]
["Eastern","5-D","WT","Isle of Wight County",1,4,18,23,1,10,0,9,0,0,0,3,0,1,2,0,0,0,0,0,0,0,0,0,0,1,0,2]
["Eastern","5-C","COLO","James City County",1,23,34,58,2,11,3,30,4,3,2,3,0,0,0,0,0,0,1,1,0,0,0,0,0,0,1,2]
["Eastern","5-A","MPNN","King and Queen County",1,0,6,7,0,2,0,3,1,1,0,0,0,0,0,0,0,0,0,0,0,0,0,0,0,0,0,0]
["Northern","2-C","RapA","King George County",0,8,16,24,2,9,0,10,0,0,1,2,0,0,1,0,0,0,0,0,0,0,0,0,0,0,0,1]
["Eastern","5-A","MPNN","King William County",0,6,25,31,0,6,1,7,4,9,2,2,0,0,0,0,0,0,0,0,0,0,0,0,0,0,0,0]
["Eastern","5-A","MPNN","Lancaster County",0,0,7,7,3,3,0,1,0,0,0,0,0,0,0,0,0,0,0,0,0,0,0,0,0,0,0,0]
["Southwestern","3-D","PLD1","Lee County",1,9,26,36,3,14,1,11,1,2,0,4,0,0,0,0,0,0,0,0,0,0,0,0,0,0,0,0]
["Western","1-C","ROC","Lexington City",0,0,4,4,2,0,0,1,0,0,1,0,0,0,1,0,0,0,0,0,0,0,0,0,0,0,0,1]
["Northern","2-A","LOUD","Loudoun County",7,93,173,273,19,66,12,90,9,33,19,25,0,0,1,0,0,0,0,2,0,0,0,0,7,3,0,9]
["Western","1-A","RTEN","Louisa County",2,15,31,48,4,19,1,12,1,3,2,6,0,0,1,0,0,0,0,0,0,0,0,0,0,0,0,1]
["Central","4-C","CROS","Lunenburg County",1,4,7,12,0,3,0,6,0,1,1,1,0,0,0,0,0,0,0,0,0,0,0,0,0,0,0,0]
["Western","1-D","HORI","Lynchburg City",1,41,187,229,17,69,7,74,5,27,14,16,0,1,2,0,0,0,1,2,0,0,0,0,0,1,9,9]
["Northern","2-B","RapR","Madison County",0,3,15,18,4,9,0,4,1,0,0,0,0,0,0,0,0,0,0,0,0,0,0,0,0,0,0,0]
["Northern","2-A","PWC","Manassas City",0,2,14,16,0,10,0,6,0,0,0,0,0,0,1,0,0,0,0,0,0,0,0,0,0,0,0,1]
["Northern","2-A","PWC","Manassas Park City",0,1,2,3,0,2,0,0,0,0,1,0,0,0,0,0,0,0,0,0,0,0,0,0,0,0,0,0]
["Southwestern","3-B","PDMT","Martinsville City",0,5,35,40,3,17,1,8,2,4,3,2,0,0,1,0,0,0,0,1,0,0,0,0,0,0,0,2]
["Eastern","5-A","MPNN","Mathews County",0,2,39,41,1,14,5,18,0,0,0,3,0,0,0,0,0,0,0,0,0,0,0,0,0,0,0,0]
["Central","4-C","SS","Mecklenburg County",0,9,88,97,3,37,1,39,3,5,6,3,0,1,1,0,0,0,0,0,0,0,0,0,0,1,1,2]
["Eastern","5-A","MPNN","Middlesex County",0,4,23,27,2,9,0,11,1,1,0,3,0,0,0,0,0,0,0,0,0,0,0,0,0,0,0,0]
["Southwestern","3-A","NRV","Montgomery County",0,39,84,123,10,19,10,40,5,19,17,3,0,2,3,0,0,0,0,3,0,0,0,1,2,1,2,4]
["Western","1-A","RTEN","Nelson County",0,8,28,36,2,13,1,13,1,3,1,2,0,0,1,0,0,0,0,0,0,0,0,0,0,0,0,1]
["Central","4-A","HENR","New Kent County",0,1,25,26,0,9,1,11,2,3,0,0,0,0,0,0,0,0,0,0,0,0,1,0,0,0,1,2]
["Eastern","5-C","HAMP","Newport News City",13,43,220,276,8,68,7,131,8,29,15,10,0,2,3,0,0,0,1,6,0,0,0,0,5,3,7,19]
["Eastern","5-D","NORF","Norfolk City",29,94,295,418,22,128,9,173,20,26,13,27,0,0,5,0,0,0,1,5,0,0,0,0,1,0,2,10]
["Eastern","5-B","EAST","Northampton County",0,2,48,50,6,24,0,15,1,2,2,0,0,0,0,0,0,0,0,0,0,0,0,0,0,0,0,0]
["Eastern","5-A","MPNN","Northumberland County",0,0,7,7,1,3,0,2,0,1,0,0,0,0,0,0,0,0,0,0,0,0,0,0,0,0,0,0]
["Southwestern","3-D","PLD1","Norton City",0,1,3,4,1,1,0,1,0,1,0,0,0,0,0,0,0,0,0,0,0,0,0,0,0,0,0,0]
["Central","4-C","CROS","Nottoway County",0,5,13,18,1,3,1,10,0,0,2,1,0,0,0,0,0,0,0,0,0,0,0,0,0,0,0,0]
["Northern","2-B","RapR","Orange County",2,21,40,63,15,24,2,13,1,3,1,4,0,1,0,0,0,0,0,0,0,0,0,0,0,1,0,1]
["Northern","2-D","NW","Page County",0,7,20,27,2,12,1,7,0,2,2,1,0,0,0,0,0,0,0,0,0,0,0,0,0,0,0,0]
["Southwestern","3-C","PDMT","Patrick County",1,4,21,26,0,9,0,10,3,3,0,1,0,0,1,0,0,0,0,0,0,0,0,0,0,0,0,1]
["Central","4-D","D19","Petersburg City",2,11,127,140,5,36,5,54,12,9,13,6,0,0,3,0,0,0,0,0,0,0,0,0,0,0,3,6]
["Southwestern","3-B","DANV","Pittsylvania County",12,21,142,175,10,56,13,53,7,13,14,9,0,1,2,0,0,0,0,0,0,0,0,0,0,0,0,2]
["Eastern","5-C","COLO","Poquoson City",0,4,1,5,0,1,1,2,0,0,0,1,0,0,0,0,0,0,0,0,0,0,0,0,0,0,0,0]
["Eastern","5-D","PORT","Portsmouth City",2,11,269,282,9,83,14,137,8,14,8,9,0,1,9,0,0,0,2,4,0,0,1,0,0,1,2,15]
["Central","4-B","GOOC","Powhatan County",1,16,22,39,1,12,0,15,1,6,1,3,0,0,2,0,0,0,0,1,0,0,0,0,0,0,1,3]
["Central","4-C","CROS","Prince Edward County",0,7,73,80,6,32,5,30,2,1,0,4,0,0,2,0,0,0,0,2,0,0,0,0,0,0,0,3]
["Central","4-D","D19","Prince George County",0,7,64,71,3,16,7,27,1,2,12,3,0,1,3,0,0,0,0,1,0,0,0,1,1,1,3,8]
["Northern","2-A","PWC","Prince William County",11,135,386,532,11,160,32,177,16,63,26,47,1,1,2,1,0,0,0,3,0,0,0,2,12,5,2,20]
["Southwestern","3-C","NRV","Pulaski County",0,20,44,64,0,11,3,21,2,11,13,3,0,0,0,0,0,0,0,0,0,0,0,0,0,0,0,0]
["Southwestern","3-C","NRV","Radford City",0,2,16,18,0,2,1,6,0,3,5,1,0,1,1,0,0,0,0,0,0,0,0,1,0,0,0,2]
["Northern","2-B","RapR","Rappahannock County",0,3,7,10,1,1,0,5,0,0,0,3,0,0,0,0,0,0,0,0,0,0,0,0,0,0,0,0]
["Central","4-A","RBHA","Richmond City",9,57,247,313,21,86,9,133,8,28,10,18,0,2,1,0,0,0,0,1,0,0,0,0,3,1,1,6]
["Eastern","5-A","MPNN","Richmond County",0,15,52,67,7,20,5,14,1,8,7,5,0,0,0,0,0,0,0,0,0,0,0,0,0,0,0,0]
["Southwestern","3-A","BLUE","Roanoke City",10,26,107,143,10,39,11,47,8,11,11,6,0,2,4,0,0,0,1,1,0,0,0,0,0,1,3,6]
["Southwestern","3-A","BLUE","Roanoke County",4,45,189,238,15,59,7,95,5,20,23,14,0,2,4,0,0,0,1,4,0,0,0,0,1,1,4,7]
["Western","1-C","ROC","Rockbridge County",0,9,52,61,5,12,6,19,2,5,9,3,0,0,0,0,0,0,0,0,0,0,0,0,0,0,0,0]
["Western","1-B","HARR","Rockingham County",2,31,111,144,10,48,6,50,4,15,3,8,0,3,3,0,0,0,1,3,0,0,1,0,0,2,2,5]
["Southwestern","3-D","CMT","Russell County",0,4,63,67,4,26,2,19,0,9,5,2,0,0,0,0,0,0,0,0,0,0,0,0,0,0,0,0]
["Southwestern","3-A","BLUE","Salem City",1,8,28,37,2,9,4,13,1,2,1,5,0,3,4,0,0,0,0,3,0,0,0,0,1,3,0,7]
["Southwestern","3-D","PLD1","Scott County",1,2,56,59,2,19,1,30,1,4,0,2,0,0,0,0,0,0,0,0,0,0,0,0,0,0,0,0]
["Northern","2-D","NW","Shenandoah County",2,17,87,106,3,40,3,46,0,8,1,5,0,0,2,0,0,0,0,0,0,0,0,0,0,0,0,2]
["Southwestern","3-D","MTRG","Smyth County",0,12,72,84,3,15,3,37,8,6,3,9,0,0,1,0,0,0,0,0,0,0,0,0,0,1,1,1]
["Eastern","5-D","WT","Southampton County",0,1,19,20,1,5,0,9,3,1,0,1,0,0,0,0,0,0,0,0,0,0,0,0,0,0,1,1]
["Northern","2-C","RapA","Spotsylvania County",3,60,212,275,21,76,19,85,6,28,21,19,0,1,5,0,0,0,0,1,0,0,0,0,0,0,1,8]
["Northern","2-C","RapA","Stafford County",4,58,164,226,15,60,13,74,10,25,16,13,0,1,2,0,0,0,0,0,0,0,0,0,3,0,0,6]
["Western","1-B","VLY","Staunton City",2,15,51,68,6,16,3,19,0,8,3,13,0,0,2,0,0,0,0,1,0,0,0,0,0,1,2,2]
["Eastern","5-D","WT","Suffolk City",0,29,161,190,9,37,7,86,9,18,16,8,0,4,3,0,1,0,0,3,0,0,0,0,1,1,2,8]
["Central","4-D","D19","Surry County",0,0,3,3,0,0,0,2,0,1,0,0,0,0,0,0,0,0,0,0,0,0,0,0,0,0,0,0]
["Central","4-D","D19","Sussex County",0,1,37,38,1,8,3,21,2,2,1,0,0,0,0,0,0,0,0,0,0,0,0,0,0,0,0,0]
["Southwestern","3-D","CMT","Tazewell County",3,15,59,77,8,22,2,27,0,11,1,6,0,0,1,0,0,0,1,1,0,0,0,0,1,0,0,2]
["Eastern","5-D","VAB","Virginia Beach City",22,179,654,855,46,254,19,379,21,60,29,47,0,3,5,0,1,0,5,18,0,0,1,0,7,5,6,28]
["Northern","2-D","NW","Warren County",2,25,19,46,7,18,3,9,0,1,0,8,0,0,1,0,0,0,0,1,0,0,0,0,0,0,0,2]
["Southwestern","3-D","HIGH","Washington County",3,15,76,94,4,29,4,35,1,15,4,2,0,0,3,0,0,0,0,1,0,0,0,0,2,1,1,5]
["Western","1-B","VLY","Waynesboro City",0,7,71,78,4,26,7,22,0,6,5,8,0,0,0,0,0,0,0,0,0,0,0,0,0,0,1,1]
["Eastern","5-A","MPNN","Westmoreland County",0,3,13,16,1,9,0,4,1,1,0,0,0,0,0,0,0,0,0,0,0,0,0,0,0,0,0,0]
["Eastern","5-C","COLO","Williamsburg City",0,5,16,21,0,8,0,5,0,1,2,5,0,0,1,0,0,0,0,1,0,0,0,0,0,0,1,2]
["Northern","2-D","NW","Winchester City",1,16,71,88,8,37,6,22,0,2,4,9,0,2,3,0,0,0,0,0,0,0,1,0,0,0,0,3]
["Southwestern","3-D","PLD1","Wise County",0,7,90,97,3,28,1,47,0,8,4,6,0,0,3,0,0,0,0,1,0,0,0,0,2,0,1,5]
["Southwestern","3-C","MTRG","Wythe County",0,6,65,71,1,7,3,27,15,9,5,4,0,1,1,0,0,0,0,0,0,0,1,0,1,2,2,3]
["Eastern","5-C","COLO","York County",0,18,42,60,3,16,2,23,2,6,4,4,0,0,0,0,0,0,0,0,0,0,0,0,1,0,0,1]
[]
["DS-Regional Totals - non-Unique"]
["Central",null,"na","na","na","na","na","na","na","na","na","na","na","na","na","na",3,10,45,0,0,0,3,16,0,1,7,1,12,6,24,90]
["Eastern",null,"na","na","na","na","na","na","na","na","na","na","na","na","na","na",0,20,46,0,2,0,11,50,0,0,4,0,25,17,36,128]
["Northern",null,"na","na","na","na","na","na","na","na","na","na","na","na","na","na",1,16,32,2,1,0,1,27,0,0,7,3,49,16,8,114]
["Southwestern",null,"na","na","na","na","na","na","na","na","na","na","na","na","na","na",0,17,41,1,0,0,5,27,0,0,2,3,12,14,22,72]
["Western",null,"na","na","na","na","na","na","na","na","na","na","na","na","na","na",0,10,22,0,0,0,3,16,0,0,2,0,1,7,27,41]
["Total nonUnique",null,"na","na","na","na","na","na","na","na","na","na","na","na","na","na",4,73,186,3,3,0,23,136,0,1,22,7,99,60,117,445]
["DS-Regional Totals - Unique"]
["Central",null,"na","na",79,502,2628,3209,215,1057,128,1151,87,217,201,153,3,9,36,0,0,0,3,14,0,1,6,1,12,6,14,70]
["Eastern",null,"na","na",89,596,2683,3368,158,946,95,1474,136,257,142,160,0,18,34,0,2,0,10,49,0,0,4,0,22,15,34,111]
["Northern",null,"na","na",69,1017,2652,3738,259,1133,171,1212,90,314,221,338,1,13,28,2,1,0,1,25,0,0,7,3,45,14,7,100]
["Southwestern",null,"na","na",68,355,2021,2444,119,608,111,912,109,271,200,114,0,13,27,1,0,0,5,20,0,0,2,1,5,7,11,40]
["Western",null,"na","na",25,342,1473,1840,125,529,67,605,43,213,112,146,0,7,15,0,0,0,3,13,0,0,2,0,1,5,17,28]
["Total Unique",null,"na","na",330,2812,11457,14599,876,4273,572,5354,465,1272,876,911,4,57,133,3,3,0,22,115,0,1,20,5,79,44,73,327]
["DS-SubRegional Totals - Unique"]
["Western","1-A","na","na",13,93,250,356,32,131,5,103,7,31,5,42,0,3,3,0,0,0,1,3,0,0,0,0,1,1,3,5]
["Western","1-B","na","na",8,93,435,536,46,160,23,166,7,60,27,47,0,4,5,0,0,0,1,5,0,0,2,0,0,3,6,10]
["Western","1-C","na","na",1,22,119,142,17,40,10,39,3,11,13,9,0,0,2,0,0,0,0,2,0,0,0,0,0,1,0,3]
["Western","1-D","na","na",4,129,677,810,31,195,27,314,29,111,65,38,0,2,6,0,0,0,1,4,0,0,0,0,0,1,11,13]
["Northern","2-A","na","na",49,700,1651,2400,130,669,112,813,64,211,158,243,1,8,12,2,0,0,1,21,0,0,5,3,42,12,4,77]
["Northern","2-B","na","na",4,67,208,279,46,113,5,67,5,15,5,23,0,1,3,0,1,0,0,0,0,0,0,0,1,1,0,5]
["Northern","2-C","na","na",8,142,481,631,53,176,35,202,21,60,44,40,0,2,6,0,0,0,0,2,0,0,1,0,3,0,3,13]
["Northern","2-D","na","na",8,108,322,438,33,173,22,133,2,27,16,32,0,3,8,0,0,0,0,2,0,0,1,0,0,1,1,9]
["Southwestern","3-A","na","na",23,157,561,741,42,180,45,263,26,93,61,31,0,8,13,0,0,0,2,10,0,0,0,1,3,4,6,17]
["Southwestern","3-B","na","na",33,81,671,785,40,189,35,287,44,71,81,38,0,2,8,1,0,0,2,8,0,0,1,0,1,2,5,16]
["Southwestern","3-C","na","na",1,43,198,242,2,40,7,91,21,38,34,9,0,4,4,0,0,0,0,2,0,0,1,1,2,3,4,8]
["Southwestern","3-D","na","na",9,77,547,633,32,188,16,257,17,68,17,38,0,0,9,0,0,0,1,3,0,0,0,0,4,2,3,13]
["Central","4-A","na","na",72,385,1927,2384,171,800,92,833,57,160,153,118,3,7,27,0,0,0,3,10,0,1,6,0,10,4,10,53]
["Central","4-B","na","na",4,25,94,123,2,41,2,51,5,13,3,6,0,0,3,0,0,0,0,1,0,0,0,0,0,0,2,5]
["Central","4-C","na","na",2,47,284,333,22,125,17,119,8,12,13,17,0,1,5,0,0,0,0,2,0,0,0,0,1,1,1,8]
["Central","4-D","na","na",2,32,364,398,12,105,23,164,20,22,37,15,0,1,6,0,0,0,0,1,0,0,0,1,1,1,6,14]
["Eastern","5-A","na","na",1,47,268,316,25,98,12,94,18,37,12,20,0,0,1,0,0,0,0,1,0,0,0,0,2,1,0,3]
["Eastern","5-B","na","na",null,8,110,118,11,48,1,46,1,8,2,1,0,0,1,0,0,0,0,1,0,0,1,0,0,0,0,1]
["Eastern","5-C","na","na",24,142,552,718,23,176,20,328,30,68,44,29,0,6,9,0,0,0,2,11,0,0,1,0,6,4,14,32]
["Eastern","5-D","na","na",64,414,1738,2216,106,626,63,984,80,156,86,115,0,13,25,0,2,0,8,36,0,0,2,0,15,10,20,78]
["(Unique) Number of Individuals with approved Jump-Start Service Authorization Lines these 6 months"]
["Number of Individuals",null,null,null,183,1045,6086,7314,503,2216,322,2562,201,739,494,277,158,402,3074,15,49,0,121,2006,0,2,157,106,348,306,2068,7314]
["Percent of possible Individuals",null,null,null,0.55454545454545456,0.3716216216216216,0.53120363096796719,0.50099321871361047,0.57420091324200917,0.51860519541305872,0.56293706293706292,0.47852073216286889,0.43225806451612903,0.58097484276729561,0.5639269406392694,0.30406147091108671]
["(Unique) Number of (approved Jump-Start) Service Authorization Lines (SALs) these 6 months"]
["Number of Jump-Start Service Authorization Lines",null,null,null,301,1782,11240,13323,870,3870,611,4673,331,1480,1043,445,191,844,4488,17,50,0,180,3154,0,2,215,158,712,490,2822,13323]
["Number of SA Lines per Person",null,null,null,1.644808743169399,1.7052631578947368,1.8468616496878081,1.8215750615258408,1.7296222664015906,1.7463898916967509,1.8975155279503106,1.8239656518345042,1.6467661691542288,2.002706359945873,2.1113360323886639,1.6064981949458483,1.2088607594936709,2.099502487562189,1.4599869876382563,1.1333333333333333,1.0204081632653061,null,1.4876033057851239,1.572283150548355,null,1,1.3694267515923566,1.4905660377358489,2.0459770114942528,1.6013071895424837,1.3646034816247583,1.8215750615258408]