{"text_format":"1","workbook":"xlsx","n_sheets":2,"sheets":["JumpStartInputTool","Master20190430"],"not_rendered":{"charts":0,"images":2,"macros":1,"external_links":0,"defined_names":6,"comments":1,"pivot_tables":0},"unopened":[],"bounds":{"document_bytes":16777216,"sheet_cells":100000,"rows_first":2000,"rows_last":500,"rows_between":2000,"halvings":0,"cell_chars":16384,"cell_head_chars":4096},"cells_cut":0,"cells_raw":0,"read":"whole","date_system":"1900"}

{"sheet":"JumpStartInputTool","index":0,"n_rows":19,"n_cols":7,"rows_kept":19,"cut":false,"hidden":false,"merged":[[18,1,18,3],[17,1,17,3],[2,2,3,2]]}
[]
[null,"Department of Behavioral Health and Developmental Services"]
[null,"Division of Developmental Services"]
[null,"Jump-Start Calculator",null,null,null,"crisis support services",1]
[null,null,null,null,null,"private duty nursing",1]
[null,"Select City or County","Chesterfield County",null,null,"skilled nursing",1]
[null,null,null,null,null,"sponsored residential",1]
[null,"Select Service","Benefits Planning",{"$f":"IFERROR(VLOOKUP(C8,F4:G7,2,0),\"\")","v":""}]
[]
[null,"Waiver Enrollees (All waivers)",{"$f":"IF(C6=\"\",\"Please Select a City/County\",CONCATENATE(VLOOKUP(C6,Master20190430!C:G,5,0),\" individual(s) were enrolled on a waiver in \",C6, \" as of \", \"Apr. 30, 2019.\"))","v":"1021 individual(s) were enrolled on a waiver in Chesterfield County as of Apr. 30, 2019."}]
[]
[null,"Building Independence Waiver",{"$f":"IF(C6=\"\",\"Please Select a City/County\",CONCATENATE(VLOOKUP(C6,Master20190430!C:D,2,0),\" individual(s) were enrolled on a BI waiver in \",C6, \" as of Apr. 30, 2019.\"))","v":"25 individual(s) were enrolled on a BI waiver in Chesterfield County as of Apr. 30, 2019."}]
[]
[null,"Total Providers of Selected Service in Selected City/County",{"$f":"IF(OR(C6=\"\",C8=\"\"),\"Please Select Both a City/County and a Service\",INDEX(Master20190430!P2:AD134,MATCH(JumpStartInputTool!C6,CityCounty,1),MATCH(JumpStartInputTool!C8,Master20190430!P1:AD1,0)))","v":0}]
[null,null,{"$f":"IF(D8=1,\"Not Eligible\",IF(OR(C6=\"\",C8=\"\"),\"Please Select Both a City/County and a Service\",INDEX(#REF!,MATCH(JumpStartInputTool!C6,CityCounty,1),MATCH(JumpStartInputTool!C8,#REF!,0))))","v":{"$error":"#REF!"}}]
[null,"Recommendations for JumpStart Application:"]
[null,{"$f":"IF(C15=\"Not Eligible\",\"This service is not eligible for JumpStart Funding.\",\"\")","v":{"$error":"#REF!"}}]
[null,"Providers are insufficient in this area. Applications will be considered."]
[null,"There are sufficient providers in this area. You may: (1) Proceed with submission knowing that an increased amount of justification will be necessary, or (2) select a different City/County and/or Service."]

{"sheet":"Master20190430","index":1,"n_rows":174,"n_cols":31,"rows_kept":174,"cut":false,"hidden":true,"merged":[]}
["DS Region","CSB"," City/County","BI waiver","FIS waiver","CL waiver","All waivers","SIS\nL1","SIS\nL2","SIS\nL3","SIS\nL4","SIS\nL5","SIS\nL6","SIS\nL7","SIS\nDefault","Benefits Planning","Community Coaching","Community Engagement","Community Guide","Electronic Home-Based Services","Employment and Community Transportation","Independent Living Supports","In-home Supports","Peer Mentoring","Shared Living","Supported Living","Crisis Support Services","Private Duty Nursing","Skilled Nursing","Sponsored Residential","Total Unique"]
["Eastern","EAST","Accomack County",0,4,62,66,9,30,1,18,0,5,1,2,0,0,2,0,0,0,0,1,0,0,1,0,0,0,0,2]
["Western","RTEN","Albemarle County",3,32,87,122,8,56,2,36,2,7,1,10,0,1,3,0,0,0,1,3,0,0,0,0,1,2,3,5]
["Northern","ALEX","Alexandria City",4,12,80,96,11,34,3,34,2,2,6,4,0,0,1,0,0,0,0,1,0,0,1,0,2,0,0,3]
["Western","ALLE","Alleghany County",1,10,35,46,7,19,1,11,0,4,2,2,0,1,1,0,0,0,0,2,0,0,0,0,0,0,0,2]
["Central","CROS","Amelia County",0,1,13,14,1,5,0,6,0,2,0,0,0,0,0,0,0,0,0,0,0,0,0,0,0,0,0,0]
["Western","HORI","Amherst County",0,11,152,163,4,38,4,76,4,19,12,6,0,1,2,0,0,0,0,0,0,0,0,0,0,1,3,3]
["Western","HORI","Appomattox County",0,9,25,34,1,11,3,9,2,5,1,2,0,1,1,0,0,0,0,1,0,0,0,0,0,0,1,2]
["Northern","ARLI","Arlington County",5,32,115,152,14,48,8,55,1,10,6,10,0,0,0,0,0,0,0,0,0,0,0,0,0,0,0,0]
["Western","VLY","Augusta County",0,17,132,149,5,48,3,44,1,26,10,12,0,1,1,0,0,0,0,1,0,0,0,0,0,0,2,2]
["Western","ROC","Bath County",0,1,8,9,2,0,2,4,0,1,0,0,0,0,0,0,0,0,0,0,0,0,0,0,0,0,0,0]
["Western","HORI","Bedford County",1,26,156,183,5,39,6,81,4,33,8,7,0,0,5,0,0,0,0,2,0,0,0,0,0,1,4,6]
["Southwestern","MTRG","Bland County",0,1,11,12,0,1,0,7,0,3,1,0,0,0,0,0,0,0,0,0,0,0,0,0,0,0,0,0]
["Southwestern","BLUE","Botetourt County",0,11,35,46,0,12,0,19,1,10,2,2,0,1,1,0,0,0,0,0,0,0,0,0,0,1,0,1]
["Southwestern","HIGH","Bristol City",1,2,43,46,2,13,2,22,1,5,0,1,0,0,1,0,0,0,0,1,0,0,0,0,0,0,0,1]
["Central","SS","Brunswick County",0,0,35,35,3,19,1,9,0,3,0,0,0,0,1,0,0,0,0,0,0,0,0,0,0,0,0,1]
["Southwestern","CMT","Buchanan County",0,4,29,33,1,12,0,12,1,4,1,2,0,0,0,0,0,0,0,0,0,0,0,0,0,0,0,0]
["Central","CROS","Buckingham County",1,2,14,17,1,6,0,7,1,1,0,1,0,0,0,0,0,0,0,0,0,0,0,0,0,0,0,0]
["Western","ROC","Buena Vista City",0,0,8,8,0,3,0,4,0,0,1,0,0,0,0,0,0,0,0,0,0,0,0,0,0,0,0,0]
["Western","HORI","Campbell County",2,24,131,157,7,36,8,61,8,19,11,7,0,0,0,0,0,0,0,0,0,0,0,0,0,0,0,0]
["Northern","RapA","Caroline County",1,8,41,50,3,19,1,18,1,3,4,1,0,0,1,0,0,0,0,0,0,0,0,0,0,0,0,1]
["Southwestern","MTRG","Carroll County",2,9,177,188,0,30,5,73,12,20,41,7,0,0,0,0,0,0,0,0,0,0,0,0,0,0,1,1]
["Central","HENR","Charles City County",0,1,3,4,0,3,0,1,0,0,0,0,0,0,1,0,0,0,0,0,0,0,0,0,0,0,0,1]
["Central","CROS","Charlotte County",0,5,28,33,3,9,4,8,0,3,3,3,0,0,2,0,0,0,0,0,0,0,0,0,0,0,0,2]
["Western","RTEN","Charlottesville City",4,10,76,90,5,43,1,23,1,11,0,6,0,0,0,0,0,0,0,0,0,0,0,0,0,0,0,0]
["Eastern","CHSP","Chesapeake City",7,69,276,352,15,101,12,145,6,33,21,19,0,5,6,0,0,0,0,5,0,0,0,0,8,2,5,20]
["Central","CHST","Chesterfield County",25,83,913,1021,63,335,51,341,23,77,73,58,0,4,11,0,0,0,0,3,0,0,3,1,4,3,5,21]
["Northern","NW","Clarke County",0,7,13,20,1,10,1,2,0,0,1,5,0,0,0,0,0,0,0,0,0,0,0,0,0,0,0,0]
["Central","D19","Colonial Heights City",1,3,15,19,4,7,0,4,1,1,1,1,0,0,2,0,0,0,0,1,0,0,0,0,0,0,1,3]
["Western","ALLE","Covington City",0,0,14,14,1,7,1,0,1,1,0,3,0,1,1,0,0,0,0,1,0,0,0,0,0,1,0,1]
["Southwestern","BLUE","Craig County",1,2,5,8,1,3,0,0,0,1,2,1,0,0,0,0,0,0,0,1,0,0,0,0,0,0,0,1]
["Northern","RapR","Culpeper County",2,8,82,92,15,42,1,18,1,4,5,6,0,1,2,0,0,0,0,0,0,0,0,0,0,1,0,2]
["Central","CROS","Cumberland County",1,2,24,27,2,8,0,15,1,0,0,1,0,0,1,0,0,0,0,0,0,0,0,0,0,0,0,1]
["Southwestern","DANV","Danville City",13,17,147,177,20,56,4,65,1,13,3,15,0,2,3,0,0,0,2,7,0,0,1,0,1,2,2,8]
["Southwestern","DCBH","Dickenson County",0,2,28,30,1,10,0,10,1,2,1,5,0,0,1,0,0,0,0,0,0,0,0,0,0,0,0,1]
["Central","D19","Dinwiddie County",0,3,62,65,1,16,6,28,3,4,4,3,0,0,0,0,0,0,0,0,0,0,0,0,0,0,0,0]
["Central","D19","Emporia City",0,3,3,6,0,0,0,2,0,2,0,2,0,0,0,0,0,0,0,0,0,0,0,0,1,0,0,1]
["Eastern","MPNN","Essex County",0,3,17,20,3,6,1,5,1,1,0,3,0,0,0,0,0,0,0,0,0,0,0,0,0,0,0,0]
["Northern","FFFC","Fairfax City",0,0,5,5,0,2,0,3,0,0,0,0,0,0,0,0,0,0,0,0,0,0,0,0,0,0,0,0]
["Northern","FFFC","Fairfax County",19,287,864,1170,71,324,53,407,23,87,74,131,0,7,8,0,0,0,2,12,0,0,2,2,29,3,2,43]
["Northern","FFFC","Falls Church City",0,1,1,2,0,0,1,0,0,0,0,1,0,0,0,0,0,0,0,0,0,0,0,0,2,0,0,2]
["Northern","RapR","Fauquier County",0,20,56,76,7,32,1,18,1,12,2,3,0,0,0,0,0,0,0,0,0,0,0,0,1,1,0,2]
["Southwestern","NRV","Floyd County",0,7,48,55,3,11,0,17,1,11,11,1,0,2,2,0,0,0,0,2,0,0,0,0,1,1,2,3]
["Western","RTEN","Fluvanna County",0,2,16,18,1,8,0,4,0,4,1,0,0,0,0,0,0,0,0,0,0,0,0,0,0,0,0,0]
["Eastern","WT","Franklin City",0,0,24,24,0,5,0,15,0,3,1,0,0,1,2,0,0,0,0,1,0,0,0,0,1,1,1,3]
["Southwestern","PDMT","Franklin County",5,14,92,111,2,39,4,26,3,20,9,8,0,0,1,0,0,0,0,0,0,0,0,0,0,0,0,1]
["Northern","NW","Frederick County",3,28,111,142,11,52,10,40,0,10,9,10,0,1,2,0,0,0,0,1,0,0,0,0,0,2,1,2]
["Northern","RapA","Fredericksburg City",0,4,46,50,10,16,1,13,4,3,2,1,0,1,1,0,0,0,0,1,0,0,1,0,0,0,2,2]
["Southwestern","MTRG","Galax City",0,1,30,31,1,8,2,9,1,2,7,1,0,2,3,0,0,0,0,1,0,0,0,0,0,0,3,5]
["Southwestern","NRV","Giles County",0,3,34,37,1,10,2,11,0,8,5,0,0,0,0,0,0,0,0,0,0,0,0,1,0,0,0,1]
["Eastern","MPNN","Gloucester County",0,10,74,84,5,30,1,15,7,16,1,9,0,1,1,0,0,0,0,1,0,0,0,0,2,1,0,3]
["Central","GOOC","Goochland County",1,6,20,27,0,11,2,8,1,3,1,1,0,0,1,0,0,0,0,1,0,0,0,0,0,0,1,2]
["Southwestern","MTRG","Grayson County",1,0,33,34,0,9,2,18,1,4,0,0,0,0,0,0,0,0,0,0,0,0,0,0,0,0,0,0]
["Western","RTEN","Greene County",0,9,16,25,2,8,1,7,1,3,0,3,0,0,0,0,0,0,0,0,0,0,0,0,0,0,0,0]
["Central","D19","Greensville County",0,1,11,12,0,3,0,7,1,1,0,0,0,0,0,0,0,0,0,0,0,0,0,0,0,0,0,0]
["Central","SS","Halifax County",1,9,72,82,8,38,6,21,2,3,1,3,0,1,1,0,0,0,0,0,0,0,0,0,0,0,0,1]
["Eastern","HAMP","Hampton City",11,39,240,290,12,110,12,99,4,26,12,15,0,2,6,0,0,0,0,3,0,0,1,0,3,1,6,12]
["Central","HANO","Hanover County",16,46,159,221,17,72,10,63,7,26,15,11,0,0,5,0,0,0,0,1,0,0,1,0,1,0,1,7]
["Western","HARR","Harrisonburg City",3,12,57,72,17,25,2,17,0,6,2,3,0,0,0,0,0,0,0,0,0,0,0,0,0,0,0,0]
["Central","HENR","Henrico County",19,113,482,614,45,231,29,204,8,28,34,35,1,4,8,0,0,0,2,6,0,1,2,0,2,1,5,15]
["Southwestern","PDMT","Henry County",3,9,85,97,9,40,1,24,2,6,6,9,0,0,0,0,0,0,0,0,0,0,0,0,0,0,0,0]
["Western","VLY","Highland County",0,0,6,6,0,1,0,4,0,1,0,0,0,0,0,0,0,0,0,0,0,0,0,0,0,0,0,0]
["Central","D19","Hopewell City",0,4,27,31,1,10,4,9,1,0,3,3,0,0,0,0,0,0,0,0,0,0,0,0,0,0,0,0]
["Eastern","WT","Isle of Wight County",2,4,24,30,2,11,0,14,1,0,0,2,0,1,2,0,0,0,0,0,0,0,0,0,0,1,0,2]
["Eastern","COLO","James City County",1,16,35,52,2,15,2,18,1,3,2,9,0,0,0,0,0,0,0,0,0,0,0,0,0,0,1,1]
["Eastern","MPNN","King and Queen County",1,0,5,6,0,3,0,1,0,2,0,0,0,0,0,0,0,0,0,0,0,0,0,0,0,0,0,0]
["Northern","RapA","King George County",0,7,17,24,2,9,0,10,0,1,1,1,0,0,1,0,0,0,0,0,0,0,0,0,0,0,0,1]
["Eastern","MPNN","King William County",0,4,25,29,0,4,2,9,2,10,0,2,0,0,0,0,0,0,0,0,0,0,0,0,0,0,0,0]
["Eastern","MPNN","Lancaster County",0,0,6,6,3,3,0,0,0,0,0,0,0,0,0,0,0,0,0,0,0,0,0,0,0,0,0,0]
["Southwestern","PLD1","Lee County",1,4,27,32,2,14,0,12,1,2,0,1,0,0,0,0,0,0,0,0,0,0,0,0,0,0,0,0]
["Western","ROC","Lexington City",0,0,4,4,2,1,0,0,0,0,1,0,0,0,1,0,0,0,0,0,0,0,0,0,0,0,0,1]
["Northern","LOUD","Loudoun County",7,63,168,238,20,65,6,71,5,25,20,26,0,0,1,0,0,0,0,3,0,0,0,0,6,0,0,8]
["Western","RTEN","Louisa County",2,10,27,39,4,15,1,8,1,2,2,6,0,0,0,0,0,0,0,0,0,0,0,0,0,0,0,0]
["Central","CROS","Lunenburg County",1,2,7,10,0,5,0,3,0,1,0,1,0,0,0,0,0,0,0,0,0,0,0,0,0,0,0,0]
["Western","HORI","Lynchburg City",1,39,178,218,19,77,7,67,5,24,8,11,0,0,2,0,0,0,1,2,0,0,0,0,0,1,9,9]
["Northern","RapR","Madison County",0,2,15,17,2,8,1,4,0,0,0,2,0,0,0,0,0,0,0,0,0,0,0,0,0,0,0,0]
["Northern","PWC","Manassas City",0,2,14,16,0,9,0,5,0,0,2,0,0,1,1,0,0,0,0,0,0,0,0,0,0,0,0,1]
["Northern","PWC","Manassas Park City",0,1,2,3,0,2,0,0,0,0,1,0,0,0,0,0,0,0,0,0,0,0,0,0,0,0,0,0]
["Southwestern","PDMT","Martinsville City",0,1,32,33,1,19,2,5,1,1,3,1,0,0,2,0,0,0,0,1,0,0,0,0,0,0,0,3]
["Eastern","MPNN","Mathews County",0,0,38,38,0,14,3,20,1,0,0,0,0,0,0,0,0,0,0,0,0,0,0,0,0,0,0,0]
["Central","SS","Mecklenburg County",0,6,87,93,4,45,6,26,1,5,2,4,0,1,1,0,0,0,0,0,0,0,0,0,0,1,1,2]
["Eastern","MPNN","Middlesex County",0,1,24,25,3,10,0,11,0,1,0,0,0,0,0,0,0,0,0,0,0,0,0,0,0,0,0,0]
["Southwestern","NRV","Montgomery County",1,31,81,113,8,17,11,27,5,19,24,2,0,1,3,0,0,0,0,3,0,0,0,1,2,2,2,4]
["Western","RTEN","Nelson County",0,6,26,32,3,13,0,12,0,3,1,0,0,1,1,0,0,0,0,0,0,0,0,0,0,0,0,1]
["Central","HENR","New Kent County",0,3,25,28,0,11,1,11,1,2,0,2,0,1,1,0,0,0,0,0,0,0,1,0,0,0,0,1]
["Eastern","HAMP","Newport News City",14,25,204,243,14,78,12,84,0,30,6,19,0,1,4,0,0,0,2,8,0,0,0,0,5,3,7,20]
["Eastern","NORF","Norfolk City",22,71,287,380,41,134,9,127,4,20,13,32,0,1,5,0,0,0,1,5,0,0,0,0,2,1,2,11]
["Eastern","EAST","Northampton County",0,1,44,45,6,25,1,9,0,4,0,0,0,0,0,0,0,0,0,0,0,0,0,0,0,0,0,0]
["Eastern","MPNN","Northumberland County",0,0,7,7,0,3,0,2,0,1,0,1,0,0,0,0,0,0,0,0,0,0,0,0,0,0,0,0]
["Southwestern","PLD1","Norton City",0,1,3,4,1,1,0,1,0,1,0,0,0,0,1,0,0,0,0,0,0,0,0,0,0,0,0,1]
["Central","CROS","Nottoway County",0,4,16,20,0,5,0,10,1,0,0,4,0,0,0,0,0,0,0,0,0,0,0,0,0,0,0,0]
["Northern","RapR","Orange County",0,16,40,56,12,24,2,12,0,4,0,2,0,1,0,0,0,0,0,0,0,0,0,0,0,1,0,1]
["Northern","NW","Page County",0,7,19,26,3,11,1,7,0,2,1,1,0,0,0,0,0,0,0,0,0,0,0,0,0,0,0,0]
["Southwestern","PDMT","Patrick County",1,4,23,28,0,14,0,9,2,2,0,1,0,0,1,0,0,0,0,0,0,0,0,0,0,0,0,1]
["Central","D19","Petersburg City",1,6,135,142,2,47,9,46,10,12,10,6,0,0,1,0,0,0,0,0,0,0,0,0,0,0,2,3]
["Southwestern","DANV","Pittsylvania County",11,15,138,164,5,75,11,37,3,13,9,11,0,1,1,0,0,0,0,0,0,0,0,0,0,0,0,1]
["Eastern","COLO","Poquoson City",0,2,2,4,1,0,1,2,0,0,0,0,0,0,0,0,0,0,0,0,0,0,0,0,0,0,0,0]
["Eastern","PORT","Portsmouth City",3,8,266,277,18,92,14,111,8,14,10,10,0,1,6,0,0,0,1,5,0,0,1,0,1,2,3,15]
["Central","GOOC","Powhatan County",1,11,24,36,0,11,2,11,1,3,2,6,0,0,2,0,0,0,0,1,0,0,0,0,0,0,0,2]
["Central","CROS","Prince Edward County",0,6,69,75,7,34,5,20,2,1,1,5,0,0,2,0,0,0,0,3,0,0,0,0,0,0,0,3]
["Central","D19","Prince George County",0,5,58,63,1,17,7,23,1,1,9,4,0,0,3,0,0,0,0,2,0,0,0,0,1,1,1,7]
["Northern","PWC","Prince William County",10,86,365,461,12,140,26,142,10,56,27,48,1,2,3,0,0,0,0,4,0,0,0,4,11,6,1,21]
["Southwestern","NRV","Pulaski County",0,17,44,61,1,8,3,14,0,10,15,10,0,0,0,0,0,0,0,0,0,0,0,0,0,0,0,0]
["Southwestern","NRV","Radford City",0,1,17,18,0,2,1,5,2,3,5,0,0,1,1,0,0,0,0,0,0,0,0,1,0,0,0,2]
["Northern","RapR","Rappahannock County",0,1,6,7,0,2,0,2,0,0,1,2,0,0,0,0,0,0,0,0,0,0,0,0,0,0,0,0]
["Central","RBHA","Richmond City",12,37,275,324,25,98,8,131,7,29,11,15,0,2,2,0,0,0,0,1,0,0,0,0,3,1,1,6]
["Eastern","MPNN","Richmond County",0,14,41,55,5,16,4,14,0,6,4,6,0,0,0,0,0,0,0,0,0,0,0,0,0,0,0,0]
["Southwestern","BLUE","Roanoke City",8,23,116,147,9,45,11,47,2,10,12,11,0,1,5,0,0,0,1,1,0,0,0,0,0,1,3,7]
["Southwestern","BLUE","Roanoke County",5,36,178,219,18,52,15,77,5,15,19,18,0,0,4,0,0,0,1,3,0,0,0,0,1,1,3,7]
["Western","ROC","Rockbridge County",0,6,57,63,9,10,6,19,0,6,8,5,0,0,0,0,0,0,0,0,0,0,0,0,0,0,0,0]
["Western","HARR","Rockingham County",3,20,118,141,9,54,3,44,3,17,4,7,0,3,3,0,0,0,1,3,0,0,1,0,0,0,2,4]
["Southwestern","CMT","Russell County",0,3,61,64,3,26,2,16,0,9,5,3,0,0,0,0,0,0,0,0,0,0,0,0,0,0,0,0]
["Southwestern","BLUE","Salem City",0,4,23,27,2,8,4,10,0,0,0,3,0,2,3,0,0,0,0,3,0,0,0,0,1,2,0,5]
["Southwestern","PLD1","Scott County",1,1,59,61,3,20,1,31,0,3,2,1,0,0,0,0,0,0,0,0,0,0,0,0,0,0,0,0]
["Northern","NW","Shenandoah County",2,14,92,108,2,44,3,47,0,7,1,4,0,2,2,0,0,0,0,0,0,0,0,0,0,0,1,3]
["Southwestern","MTRG","Smyth County",0,4,74,78,3,17,2,34,4,7,5,6,0,0,1,0,0,0,0,0,0,0,0,0,0,0,1,1]
["Eastern","WT","Southampton County",0,1,19,20,1,6,1,9,1,1,0,1,0,0,0,0,0,0,0,0,0,0,0,0,0,0,0,0]
["Northern","RapA","Spotsylvania County",3,41,207,251,19,76,12,81,5,26,13,19,1,1,4,0,0,0,0,1,0,0,0,0,0,0,1,6]
["Northern","RapA","Stafford County",4,45,168,217,17,60,13,63,8,23,14,19,0,0,1,0,0,0,0,0,0,0,0,0,2,0,0,3]
["Western","VLY","Staunton City",0,10,56,66,5,19,5,20,1,7,3,6,0,1,2,0,0,0,0,1,0,0,0,0,0,1,2,2]
["Eastern","WT","Suffolk City",0,16,152,168,7,46,9,66,1,17,10,12,0,3,3,0,0,0,0,2,0,0,0,0,1,1,1,6]
["Central","D19","Surry County",0,0,3,3,0,1,0,0,0,2,0,0,0,0,0,0,0,0,0,0,0,0,0,0,0,0,0,0]
["Central","D19","Sussex County",0,1,36,37,1,11,2,20,1,1,1,0,0,0,0,0,0,0,0,0,0,0,0,0,0,0,0,0]
["Southwestern","CMT","Tazewell County",2,10,62,74,6,24,0,23,0,11,1,9,0,0,1,0,0,0,0,1,0,0,0,0,1,0,0,2]
["Eastern","VAB","Virginia Beach City",19,135,658,812,47,250,22,336,13,59,30,55,0,3,5,0,0,0,4,15,0,0,2,0,6,6,7,24]
["Northern","NW","Warren County",1,21,14,36,5,15,3,7,0,3,0,3,0,1,1,0,0,0,0,1,0,0,0,0,0,0,0,2]
["Southwestern","HIGH","Washington County",1,11,76,88,4,26,0,34,1,15,3,5,0,0,2,0,0,0,0,1,0,0,0,0,2,1,1,4]
["Western","VLY","Waynesboro City",0,5,68,73,4,28,4,23,0,5,4,5,0,1,0,0,0,0,0,0,0,0,0,0,0,0,1,2]
["Eastern","MPNN","Westmoreland County",0,3,12,15,2,5,1,5,0,0,0,2,0,0,0,0,0,0,0,0,0,0,0,0,0,0,0,0]
["Eastern","COLO","Williamsburg City",0,2,13,15,0,9,0,2,0,1,2,1,0,0,1,0,0,0,0,1,0,0,0,0,0,0,1,2]
["Northern","NW","Winchester City",1,15,77,93,7,43,4,21,0,5,7,6,0,1,3,0,0,0,0,0,0,0,1,0,0,1,0,4]
["Southwestern","PLD1","Wise County",0,5,92,97,5,31,4,33,2,6,6,10,0,0,5,0,0,0,0,1,0,0,0,0,1,0,1,6]
["Southwestern","MTRG","Wythe County",0,8,69,77,2,12,4,25,8,9,12,5,0,1,1,0,0,0,0,0,0,0,1,0,1,1,1,2]
["Eastern","COLO","York County",0,8,41,49,4,16,0,20,0,5,0,4,0,0,0,0,0,0,0,0,0,0,0,0,1,0,0,1]
[]
["DS-Regional Totals - non-Unique"]
["Central","na","na","na","na","na","na","na","na","na","na","na","na","na","na",1,13,45,0,0,0,2,19,0,1,7,1,12,7,18,79]
["Eastern","na","na","na","na","na","na","na","na","na","na","na","na","na","na",0,14,37,0,0,0,8,42,0,0,5,0,22,17,29,102]
["Northern","na","na","na","na","na","na","na","na","na","na","na","na","na","na",2,19,32,0,0,0,2,24,0,0,5,6,53,15,8,107]
["Southwestern","na","na","na","na","na","na","na","na","na","na","na","na","na","na",0,14,43,0,0,0,4,26,0,0,2,3,11,12,20,69]
["Western","na","na","na","na","na","na","na","na","na","na","na","na","na","na",0,17,29,0,0,0,3,21,0,0,1,0,9,9,32,60]
["Total nonUnique","na","na","na","na","na","na","na","na","na","na","na","na","na","na",{"$f":"SUM(P137:P141)","v":3},{"$f":"SUM(Q137:Q141)","v":77},186,0,0,0,19,132,0,1,20,10,107,60,107,417]
["DS-Regional Totals - Unique"]
["Central","na","na",80,363,2616,3059,189,1058,153,1034,74,211,171,169,1,12,36,0,0,0,2,17,0,1,6,1,12,7,12,64]
["Eastern","na","na",80,436,2596,3112,200,1022,108,1157,50,258,113,204,0,17,33,0,0,0,7,45,0,0,5,0,26,17,32,106]
["Northern","na","na",62,728,2618,3408,244,1087,151,1080,61,283,197,305,2,17,29,0,0,0,2,22,0,0,5,6,50,12,7,96]
["Southwestern","na","na",57,261,1972,2290,114,665,93,753,61,245,210,149,0,10,29,0,0,0,4,20,0,0,2,1,6,7,10,42]
["Western","na","na",20,259,1453,1732,120,559,60,574,34,204,80,101,0,7,15,0,0,0,3,13,0,0,1,0,1,4,18,27]
["Total Unique","na","na",299,2047,11255,13601,867,4391,565,4598,280,1201,771,928,3,59,134,0,0,0,18,108,0,1,19,8,89,41,69,314]
[]
[]
[]
[]
[]
[]
[]
[]
[]
[]
["Benefits Planning"]
["Community Coaching"]
["Community Engagement"]
["Community Guide"]
["Electronic Home-Based Services"]
["Employment and Community Transportation"]
["Independent Living Supports"]
["In-home Supports"]
["Peer Mentoring"]
["Shared Living"]
["Supported Living"]
["Crisis Support Services"]
["Private Duty Nursing"]
["Skilled Nursing"]
["Sponsored Residential"]